BDBM50457569 CHEMBL4205304
SMILES COCCOCOc1ccc(cc1-c1ccc2c(c1)C(C)(C)CCC2(C)C)-c1ccc(cc1F)C(O)=O
InChI Key InChIKey=ORQKUEXLPUFCSX-UHFFFAOYSA-N
Data  1 EC50
  Tab Delimited (TSV)   2D SDfile   Computed 3D by Vconf -m prep SDfile
Find this compound or compounds like it in BindingDB:
Activity Spreadsheet -- Enzyme Inhibition Constant Data from BindingDB
Found 1 hit for monomerid = 50457569
TargetRetinoic acid receptor gamma(Homo sapiens (Human))
Nestle Skin Health
Curated by ChEMBL
LigandPNGBDBM50457569(CHEMBL4205304)
Affinity DataEC50:  279nM. Assay description: Agonist activity at GAL4 DNA-binding domain-tagged RARgamma (unknown origin) ligand-binding domain expressed in human HG5LN cells incubated for 18 hr...
Ligand InfoPC cidPC sid
In DepthDetails ArticlePubMed