BDBM50458275 CHEMBL4204853
SMILES CC1(C)CCc2ccc3C(F)=CC(=O)C(=O)c3c2C1
InChI Key InChIKey=SHQRDIBAHSSXGL-UHFFFAOYSA-N
Data  1 KI
  Tab Delimited (TSV)   2D SDfile   Computed 3D by Vconf -m prep SDfile
Find this compound or compounds like it in BindingDB:
Activity Spreadsheet -- Enzyme Inhibition Constant Data from BindingDB
Found 1 hit for monomerid = 50458275
TargetLiver carboxylesterase 1(Homo sapiens (Human))
St. Jude Children'S Research Hospital
Curated by ChEMBL
LigandPNGBDBM50458275(CHEMBL4204853)
Affinity DataKi:  14nM. Assay description: Inhibition of human liver carboxylesterase 1 using o-nitrophenyl acetate as substrate
Ligand InfoPC cidPC sid
In DepthDetails ArticlePubMed