BDBM50458364 CHEMBL4203420
SMILES Nc1nc(SCc2ccn[nH]2)c(C#N)c(-c2ccc(OCC3CC3)cc2)c1C#N
InChI Key InChIKey=PTRQRGIIUCPMOB-UHFFFAOYSA-N
Data  1 KI  1 EC50
  Tab Delimited (TSV)   2D SDfile   Computed 3D by Vconf -m prep SDfile
Find this compound or compounds like it in BindingDB:
Activity Spreadsheet -- Enzyme Inhibition Constant Data from BindingDB
Found 2 hits for monomerid = 50458364
TargetAdenosine receptor A1(Homo sapiens (Human))
Universit£
Curated by ChEMBL
LigandPNGBDBM50458364(CHEMBL4203420)
Affinity DataKi:  552nM. Assay description: Displacement of [3H]DPCPX from human adenosine A1 receptor expressed in CHO cell membranes after 90 mins by scintillation counting analysis
Ligand InfoPC cidPC sid
In DepthDetails ArticlePubMed
TargetAdenosine receptor A2b(Homo sapiens (Human))
Universit£
Curated by ChEMBL
LigandPNGBDBM50458364(CHEMBL4203420)
Affinity DataEC50:  84nM. Assay description: Agonist activity at human adenosine A2B receptor expressed in CHO cell membranes assessed as induction of cAMP accumulation by AlphaScreen assay
Ligand InfoPC cidPC sid
In DepthDetails ArticlePubMed