BDBM50458415 CHEMBL567508::EN300-02284
SMILES NC(=O)c1c(N)sc2CCCCc12
InChI Key InChIKey=FFAKFORHXDNYEN-UHFFFAOYSA-N
Data  2 IC50
  Tab Delimited (TSV)   2D SDfile   Computed 3D by Vconf -m prep SDfile
Find this compound or compounds like it in BindingDB:
Activity Spreadsheet -- Enzyme Inhibition Constant Data from BindingDB
Found 2 hits for monomerid = 50458415
TargetReplicase polyprotein 1ab(2019-nCoV)
Cornell University
LigandPNGBDBM50458415(CHEMBL567508 | EN300-02284)
Affinity DataIC50:  2.43E+3nM. Assay description: IC50 values were determined for the whole plate in case of Chan-Lam coupling, using 5 point 3-fold dilutions (starting from 10 μM).
In DepthDetails PubMed
TargetUbiquitin carboxyl-terminal hydrolase 2(Homo sapiens (Human))
Jagiellonian University
Curated by ChEMBL
LigandPNGBDBM50458415(CHEMBL567508 | EN300-02284)
Affinity DataIC50:  8.70E+3nM. Assay description: Inhibition of human USP2a (258 to 605 residues) expressed in Escherichia coli BL21(DE3) using Ub-AMC as substrate incubated for 30 mins measured at 3...
In DepthDetails ArticlePubMed