BDBM50459596 CHEMBL4210829
SMILES COc1ccccc1-n1c(SCc2cccc(F)c2)nc2n(C)ncc2c1=O
InChI Key InChIKey=GJIGSVCWRVPBKH-UHFFFAOYSA-N
Data  3 IC50
  Tab Delimited (TSV)   2D SDfile   Computed 3D by Vconf -m prep SDfile
Find this compound or compounds like it in BindingDB:
Activity Spreadsheet -- Enzyme Inhibition Constant Data from BindingDB
Found 3 hits for monomerid = 50459596
TargetAldehyde dehydrogenase 1A1(Homo sapiens (Human))
Indiana University School Of Medicine
Curated by ChEMBL
LigandPNGBDBM50459596(CHEMBL4210829)
Affinity DataIC50:  970nM. Assay description: Inhibition of human recombinant ALDH1A1 assessed as reduction in of NAD(P)H formation incubated for 2 mins by spectrophotometry
Ligand InfoPC cidPC sid
In DepthDetails ArticlePubMed
TargetRetinal dehydrogenase 2(Homo sapiens (Human))
Indiana University School Of Medicine
Curated by ChEMBL
LigandPNGBDBM50459596(CHEMBL4210829)
Affinity DataIC50: >1.00E+4nM. Assay description: Inhibition of human recombinant ALDH1A2 assessed as reduction in of NAD(P)H formation incubated for 2 mins by spectrophotometry
Ligand InfoPC cidPC sid
In DepthDetails ArticlePubMed
TargetAldehyde dehydrogenase family 1 member A3(Homo sapiens (Human))
Indiana University School Of Medicine
Curated by ChEMBL
LigandPNGBDBM50459596(CHEMBL4210829)
Affinity DataIC50: >1.00E+4nM. Assay description: Inhibition of human recombinant ALDH1A3 assessed as reduction in of NAD(P)H formation incubated for 2 mins by spectrophotometry
Ligand InfoPC cidPC sid
In DepthDetails ArticlePubMed