BDBM50459604 CHEMBL4209599
SMILES Cc1ccccc1-n1c(SCc2cccc(F)c2)nc2nn(CC3COC3)cc2c1=O
InChI Key InChIKey=LJOVPCLFJXMWSS-UHFFFAOYSA-N
Data  3 IC50
  Tab Delimited (TSV)   2D SDfile   Computed 3D by Vconf -m prep SDfile
Find this compound or compounds like it in BindingDB:
Activity Spreadsheet -- Enzyme Inhibition Constant Data from BindingDB
Found 3 hits for monomerid = 50459604
TargetAldehyde dehydrogenase family 1 member A3(Homo sapiens (Human))
Indiana University School Of Medicine
Curated by ChEMBL
LigandPNGBDBM50459604(CHEMBL4209599)
Affinity DataIC50:  2.60E+3nM. Assay description: Inhibition of human recombinant ALDH1A3 assessed as reduction in of NAD(P)H formation incubated for 2 mins by spectrophotometry
Ligand InfoPC cidPC sid
In DepthDetails ArticlePubMed
TargetAldehyde dehydrogenase 1A1(Homo sapiens (Human))
Indiana University School Of Medicine
Curated by ChEMBL
LigandPNGBDBM50459604(CHEMBL4209599)
Affinity DataIC50:  200nM. Assay description: Inhibition of human recombinant ALDH1A1 assessed as reduction in of NAD(P)H formation incubated for 2 mins by spectrophotometry
Ligand InfoPC cidPC sid
In DepthDetails ArticlePubMed
TargetRetinal dehydrogenase 2(Homo sapiens (Human))
Indiana University School Of Medicine
Curated by ChEMBL
LigandPNGBDBM50459604(CHEMBL4209599)
Affinity DataIC50:  3.90E+3nM. Assay description: Inhibition of human recombinant ALDH1A2 assessed as reduction in of NAD(P)H formation incubated for 2 mins by spectrophotometry
Ligand InfoPC cidPC sid
In DepthDetails ArticlePubMed