BDBM50459923 CHEMBL4228464
SMILES [H][C@]12CC[C@](C1)([C@@H](COC)CN2)c1ccc(Cl)c(Cl)c1
InChI Key InChIKey=DRKVKHDMRAXUGE-TYNCELHUSA-N
Data  3 KI
  Tab Delimited (TSV)   2D SDfile   Computed 3D by Vconf -m prep SDfile
Find this compound or compounds like it in BindingDB:
Activity Spreadsheet -- Enzyme Inhibition Constant Data from BindingDB
Found 3 hits for monomerid = 50459923
TargetSodium-dependent noradrenaline transporter(Homo sapiens (Human))
Biocon Bristol-Myers Squibb R&D Centre
Curated by ChEMBL
LigandPNGBDBM50459923(CHEMBL4228464)
Affinity DataKi:  0.0794nM. Assay description: Binding affinity to human NET
Ligand InfoPC cidPC sid
In DepthDetails ArticlePubMed
TargetSodium-dependent serotonin transporter(Homo sapiens (Human))
Biocon Bristol-Myers Squibb R&D Centre
Curated by ChEMBL
LigandPNGBDBM50459923(CHEMBL4228464)
Affinity DataKi:  1.30nM. Assay description: Binding affinity to human SERT
Ligand InfoPC cidPC sid
In DepthDetails ArticlePubMed
TargetSodium-dependent dopamine transporter(Homo sapiens (Human))
Biocon Bristol-Myers Squibb R&D Centre
Curated by ChEMBL
LigandPNGBDBM50459923(CHEMBL4228464)
Affinity DataKi:  1.5nM. Assay description: Binding affinity to human DAT
Ligand InfoPC cidPC sid
In DepthDetails ArticlePubMed