BDBM50460991 CHEMBL4227317
SMILES CC(=O)Nc1ccccc1-c1cccc2c1[nH]c1c(Cl)c(Cl)ccc21
InChI Key InChIKey=NBOLCRLYNDUVOP-UHFFFAOYSA-N
Data  1 IC50
  Tab Delimited (TSV)   2D SDfile   Computed 3D by Vconf -m prep SDfile
Find this compound or compounds like it in BindingDB:
Activity Spreadsheet -- Enzyme Inhibition Constant Data from BindingDB
Found 1 hit for monomerid = 50460991
TargetProtein mono-ADP-ribosyltransferase PARP14(Homo sapiens (Human))
University Of Oxford
Curated by ChEMBL
LigandPNGBDBM50460991(CHEMBL4227317)
Affinity DataIC50:  1.40E+3nM. Assay description: Displacement of ARTK(Bio)QTARK(Aoa-RADP)S from His6-tagged PARP14 MD2 (A994 to N1191 residues) (unknown origin) expressed in bacterial expression sys...
Ligand InfoPC cidPC sid
In DepthDetails ArticlePubMed