BDBM50461085 CHEMBL4228331
SMILES CCc1ccc(cc1)N(CC(C)C)S(=O)(=O)c1ccc(OCC2CCOCC2)c(c1)S(C)(=N)=O
InChI Key InChIKey=OZSLLZRELNMFLA-UHFFFAOYSA-N
Data  1 IC50
  Tab Delimited (TSV)   2D SDfile   Computed 3D by Vconf -m prep SDfile
Find this compound or compounds like it in BindingDB:
Activity Spreadsheet -- Enzyme Inhibition Constant Data from BindingDB
Found 1 hit for monomerid = 50461085
TargetNuclear receptor ROR-gamma(Homo sapiens (Human))
Nestle Skin Health
Curated by ChEMBL
LigandPNGBDBM50461085(CHEMBL4228331)
Affinity DataIC50:  47nM. Assay description: Inverse agonist activity at RORgamma (unknown origin) expressed in human HeLa-derived HG5LN cells transfected with the GAL4 DNA-binding domain fused ...
Ligand InfoPC cidPC sid
In DepthDetails ArticlePubMed