BDBM50462584 CHEMBL4245260
SMILES CNC(=O)NC(=N)NCCC[C@H](NC(=O)Cn1nncc1CO\N=C\c1ccnc2ccccc12)C(=O)N(Cc1ccccc1)Cc1ccccc1
InChI Key InChIKey=YASCYEPUKAYRJI-IPZIAFNWSA-N
Data  2 IC50
PDB links: 1 PDB ID matches this monomer.
  Tab Delimited (TSV)   2D SDfile   Computed 3D by Vconf -m prep SDfile
Find this compound or compounds like it in BindingDB:
Activity Spreadsheet -- Enzyme Inhibition Constant Data from BindingDB
Found 2 hits for monomerid = 50462584
TargetChitinase B(Serratia marcescens)
Universit£
Curated by ChEMBL
LigandPNGBDBM50462584(CHEMBL4245260)
Affinity DataIC50:  22nM. Assay description: Inhibition of Serratia marcescens chitinase B
Ligand InfoPC cidPC sidPDB
TargetChitinase B(Serratia marcescens)
Universit£
Curated by ChEMBL
LigandPNGBDBM50462584(CHEMBL4245260)
Affinity DataIC50:  22nM. Assay description: Inhibition of Serratia marcescens 6x-His-tagged ChiB after 20 hrs by LCMS-SIR analysis
Ligand InfoPC cidPC sidPDB