BDBM50463374 CHEMBL3356738
SMILES COc1ccccc1\C=C1/Oc2c(C1=O)c1OC3=CC(O)=C(C(C)=O)C(=O)[C@]3(C)c1c(O)c2C
InChI Key InChIKey=CQPNCOSPSWYHTO-IXTHLRQQSA-N
Data  1 IC50
  Tab Delimited (TSV)   2D SDfile   Computed 3D by Vconf -m prep SDfile
Find this compound or compounds like it in BindingDB:
Activity Spreadsheet -- Enzyme Inhibition Constant Data from BindingDB
Found 1 hit for monomerid = 50463374
TargetTyrosyl-DNA phosphodiesterase 1(Homo sapiens (Human))
Siberian Branch Of The Russian Academy Of Sciences
Curated by ChEMBL
LigandPNGBDBM50463374(CHEMBL3356738)
Affinity DataIC50:  390nM. Assay description: Inhibition of recombinant Tdp1 (unknown origin) using 5'-(5,6 FAM-aac gtc agg gtc ttc c-BHQ1)-3' as substrate measured every 55 secs for 8 mins by fl...
Ligand InfoPC cidPC sid
In DepthDetails ArticlePubMed