BDBM50463757 CHEMBL4249385
SMILES CCC(CCCCC(=O)NO)Nc1c(Nc2ccc(cc2)C(F)(F)F)c(=O)c1=O
InChI Key InChIKey=HPBVHKMDSJLCCK-UHFFFAOYSA-N
Data  1 KI
  Tab Delimited (TSV)   2D SDfile   Computed 3D by Vconf -m prep SDfile
Find this compound or compounds like it in BindingDB:
Activity Spreadsheet -- Enzyme Inhibition Constant Data from BindingDB
Found 1 hit for monomerid = 50463757
TargetHistone deacetylase 1(Homo sapiens (Human))
Nestle Skin Health R&D
Curated by ChEMBL
LigandPNGBDBM50463757(CHEMBL4249385)
Affinity DataKi:  0.510nM. Assay description: Inhibition of human recombinant HDAC1 using Fluor de Lys as substrate after 2 hrs by fluorescence method
Ligand InfoPC cidPC sid
In DepthDetails ArticlePubMed