BDBM50463770 CHEMBL4238919
SMILES CNc1cc(F)cc2c1[nH]c1nc(CNC(=O)c3cocn3)nc(N3CCC(N)C3)c21
InChI Key InChIKey=WRRYWYLIRTYXGI-UHFFFAOYSA-N
Data  2 IC50
  Tab Delimited (TSV)   2D SDfile   Computed 3D by Vconf -m prep SDfile
Find this compound or compounds like it in BindingDB:
Activity Spreadsheet -- Enzyme Inhibition Constant Data from BindingDB
Found 2 hits for monomerid = 50463770
TargetDNA gyrase subunit B(Mycobacterium tuberculosis (strain ATCC 25618 / H3...)
Redx Pharma
Curated by ChEMBL
LigandPNGBDBM50463770(CHEMBL4238919)
Affinity DataIC50:  25nM. Assay description: Inhibition of Mycobacterium tuberculosis DNA gyrase ATPase activity
Ligand InfoPC cidPC sid
In DepthDetails ArticlePubMed
TargetDNA gyrase subunit B(Mycobacterium tuberculosis (strain ATCC 25618 / H3...)
Redx Pharma
Curated by ChEMBL
LigandPNGBDBM50463770(CHEMBL4238919)
Affinity DataIC50:  5nM. Assay description: Inhibition of Mycobacterium tuberculosis DNA gyrase activity
Ligand InfoPC cidPC sid
In DepthDetails ArticlePubMed