BDBM50463894 CHEMBL4238409
SMILES CCC1NC(CC)C(O)C(O)C1O
InChI Key InChIKey=OLSJFEJSUNZHMA-UHFFFAOYSA-N
Data  1 IC50
  Tab Delimited (TSV)   2D SDfile   Computed 3D by Vconf -m prep SDfile
Find this compound or compounds like it in BindingDB:
Activity Spreadsheet -- Enzyme Inhibition Constant Data from BindingDB
Found 1 hit for monomerid = 50463894
TargetProbable maltase-glucoamylase 2(Homo sapiens)
Shiv Nadar University
Curated by ChEMBL
LigandPNGBDBM50463894(CHEMBL4238409)
Affinity DataIC50:  1.00E+4nM. Assay description: Inhibition of alpha-glucosidase (unknown origin)
Ligand InfoPC cidPC sid
In DepthDetails ArticlePubMed