BDBM50464439 CHEMBL4293927
SMILES Cc1ccc(CN2CCN(CC2)S(=O)(=O)c2ccc(Cl)c(Cl)c2)cc1
InChI Key InChIKey=COVNPNBWKVMQRQ-UHFFFAOYSA-N
Data  1 IC50
  Tab Delimited (TSV)   2D SDfile   Computed 3D by Vconf -m prep SDfile
Find this compound or compounds like it in BindingDB:
Activity Spreadsheet -- Enzyme Inhibition Constant Data from BindingDB
Found 1 hit for monomerid = 50464439
TargetPancreatic alpha-amylase(Sus scrofa (Pig))
University Of Dammam
Curated by ChEMBL
LigandPNGBDBM50464439(CHEMBL4293927)
Affinity DataIC50:  2.98E+3nM. Assay description: Inhibition of porcine pancreatic alpha-amylase using starch as substrate preincubated for 10 mins followed by substrate addition measured after 10 mi...
In DepthDetails ArticlePubMed