BDBM50464753 CHEMBL4288380
SMILES Nc1cc(-c2ccc(cc2)C(F)(F)F)c2oc(nc2c1)-c1ccco1
InChI Key InChIKey=WXWUARCFGHCJPG-UHFFFAOYSA-N
Data  1 KI
  Tab Delimited (TSV)   2D SDfile   Computed 3D by Vconf -m prep SDfile
Find this compound or compounds like it in BindingDB:
Activity Spreadsheet -- Enzyme Inhibition Constant Data from BindingDB
Found 1 hit for monomerid = 50464753
TargetAdenosine receptor A2a(Homo sapiens (Human))
Umr-S1172 - Jparc - Centre De Recherche Jean-Pierre Aubert Neurosciences Et Cancer
Curated by ChEMBL
LigandPNGBDBM50464753(CHEMBL4288380)
Affinity DataKi: >1.00E+4nM. Assay description: Displacement of [3H]-ZM241385 from human adenosine A2A receptor expressed in CHO cell membranes after 1 hr by TopCount microplate scintillation count...
Ligand InfoPC cidPC sid
In DepthDetails ArticlePubMed