BDBM50465669 CHEMBL4294703
SMILES Cc1ccc(CNC(=O)Nc2cc(ccc2O)S(N)(=O)=O)cc1
InChI Key InChIKey=WPPWDFYGZHFOAE-UHFFFAOYSA-N
Data  4 KI
PDB links: 1 PDB ID matches this monomer.
  Tab Delimited (TSV)   2D SDfile   Computed 3D by Vconf -m prep SDfile
Find this compound or compounds like it in BindingDB:
Activity Spreadsheet -- Enzyme Inhibition Constant Data from BindingDB
Found 4 hits for monomerid = 50465669
TargetCarbonic anhydrase 12(Homo sapiens (Human))
University Of Florence
Curated by ChEMBL
LigandPNGBDBM50465669(CHEMBL4294703)
Affinity DataKi:  5.70nM. Assay description: Inhibition of human CA12 assessed as enzyme inhibitor complex formation preincubated for 15 mins and measured for 10 to 100 secs by phenol red dye ba...
Ligand InfoPC cidPC sidPDB
In DepthDetails ArticlePubMed
TargetCarbonic anhydrase 9(Homo sapiens (Human))
University Of Florence
Curated by ChEMBL
LigandPNGBDBM50465669(CHEMBL4294703)
Affinity DataKi:  263nM. Assay description: Inhibition of human CA9 assessed as enzyme inhibitor complex formation preincubated for 15 mins and measured for 10 to 100 secs by phenol red dye bas...
Ligand InfoPC cidPC sidPDB
In DepthDetails ArticlePubMed
TargetCarbonic anhydrase 1(Homo sapiens (Human))
University Of Florence
Curated by ChEMBL
LigandPNGBDBM50465669(CHEMBL4294703)
Affinity DataKi:  273nM. Assay description: Inhibition of human CA1 assessed as enzyme inhibitor complex formation preincubated for 15 mins and measured for 10 to 100 secs by phenol red dye bas...
Ligand InfoPC cidPC sidPDB
TargetCarbonic anhydrase 2(Homo sapiens (Human))
University Of Florence
Curated by ChEMBL
LigandPNGBDBM50465669(CHEMBL4294703)
Affinity DataKi:  668nM. Assay description: Inhibition of human CA2 assessed as enzyme inhibitor complex formation preincubated for 15 mins and measured for 10 to 100 secs by phenol red dye bas...
Ligand InfoPC cidPC sidPDB
In DepthDetails ArticlePubMed