BDBM50466729 CHEMBL4293881
SMILES CCCc1n[nH]c2OC(N)=C(C#N)C(c12)c1cc(OC)c(O)c(c1)[N+]([O-])=O
InChI Key InChIKey=RWKXJNWNTFOJQN-UHFFFAOYSA-N
Data  2 IC50
  Tab Delimited (TSV)   2D SDfile   Computed 3D by Vconf -m prep SDfile
Find this compound or compounds like it in BindingDB:
Activity Spreadsheet -- Enzyme Inhibition Constant Data from BindingDB
Found 2 hits for monomerid = 50466729
TargetAldo-keto reductase family 1 member C3(Homo sapiens (Human))
Guangzhou Medical University
Curated by ChEMBL
LigandPNGBDBM50466729(CHEMBL4293881)
Affinity DataIC50:  227nM. Assay description: Inhibition of recombinant human AKR1C3 expressed in Escherichia coli BL21 cells in presence of 9,10-phenanthrenequinone and NADPH by fluorescence ass...
In DepthDetails ArticlePubMed
TargetAldo-keto reductase family 1 member C1(Homo sapiens (Human))
Guangzhou Medical University
Curated by ChEMBL
LigandPNGBDBM50466729(CHEMBL4293881)
Affinity DataIC50:  411nM. Assay description: Inhibition of recombinant human AKR1C1 expressed in Escherichia coli BL21 cells in presence of 9,10-phenanthrenequinone and NADPH by fluorescence ass...
In DepthDetails ArticlePubMed