BDBM50466752 CHEMBL4281138
SMILES CSc1cc(C)nc(SC)c1NC(=O)CN1CCN(CCSc2nc3ccccc3s2)CC1
InChI Key InChIKey=AMJCKXKAZQZZDV-UHFFFAOYSA-N
Data  1 IC50
  Tab Delimited (TSV)   2D SDfile   Computed 3D by Vconf -m prep SDfile
Find this compound or compounds like it in BindingDB:
Activity Spreadsheet -- Enzyme Inhibition Constant Data from BindingDB
Found 1 hit for monomerid = 50466752
TargetSterol O-acyltransferase 1(Homo sapiens (Human))
Kowa
Curated by ChEMBL
LigandPNGBDBM50466752(CHEMBL4281138)
Affinity DataIC50:  3nM. Assay description: Inhibition of ACAT in human J774A.1 cells assessed as reduction in esterified-cholesterol accumulation after 18 hrs in presence of 25-hydroxycholeste...
Ligand InfoPC cidPC sid
In DepthDetails ArticlePubMed