BDBM50468040 CHEMBL4289763
SMILES [H][C@@]12CN(C[C@@]1(NC(=N)N(C)C2=O)c1cc(cs1)-c1cccc(c1)C#N)c1ncc(F)c(C)n1
InChI Key InChIKey=MGPRPDLGSONHLQ-SBUREZEXSA-N
Data  1 KI  1 IC50
  Tab Delimited (TSV)   2D SDfile   Computed 3D by Vconf -m prep SDfile
Find this compound or compounds like it in BindingDB:
Activity Spreadsheet -- Enzyme Inhibition Constant Data from BindingDB
Found 2 hits for monomerid = 50468040
TargetBeta-secretase 1(Homo sapiens (Human))
TBA
Curated by ChEMBL
LigandPNGBDBM50468040(CHEMBL4289763)
Affinity DataKi:  0.700nM. Assay description: Inhibition of recombinant human BACE1 expressed in HEK293 cells
Ligand InfoPC cidPC sid
In DepthDetails ArticlePubMed
TargetCytochrome P450 3A4(Homo sapiens (Human))
TBA
Curated by ChEMBL
LigandPNGBDBM50468040(CHEMBL4289763)
Affinity DataIC50:  600nM. Assay description: Inhibition of CYP3A4 in human liver microsomes using testosterone as substrate preincubated for 30 mins followed by substrate/NADPH addition measured...
Ligand InfoPC cidPC sid
In DepthDetails ArticlePubMed