BDBM50468170 CHEMBL4292853
SMILES OC(=O)CC[C@H](NC(=O)N[C@@H](CCCC(=O)Nc1ccc(F)nc1)C(O)=O)C(O)=O
InChI Key InChIKey=OAJLMFWIFAWMDP-QWRGUYRKSA-N
Data  1 IC50
PDB links: 1 PDB ID matches this monomer.
  Tab Delimited (TSV)   2D SDfile   Computed 3D by Vconf -m prep SDfile
Find this compound or compounds like it in BindingDB:
Activity Spreadsheet -- Enzyme Inhibition Constant Data from BindingDB
Found 1 hit for monomerid = 50468170
TargetGlutamate carboxypeptidase 2(Homo sapiens (Human))
University Of Illinois At Chicago
Curated by ChEMBL
LigandPNGBDBM50468170(CHEMBL4292853)
Affinity DataIC50:  0.990nM. Assay description: Inhibition of recombinant human PSMA using [3H]NAAG as substrate preincubated for 15 mins followed by substrate addition measured after 20 mins by li...
Ligand InfoPC cidPC sidPDB