BDBM50469133 CHEMBL4283364
SMILES [#7]S(=O)(=O)c1ccc(cc1)-c1ncc(-[#6]Cl)[se;v2]1
InChI Key InChIKey=UUSUUFIKTNRGKD-UHFFFAOYSA-N
Data  6 KI
PDB links: 1 PDB ID matches this monomer.
  Tab Delimited (TSV)   2D SDfile   Computed 3D by Vconf -m prep SDfile
Find this compound or compounds like it in BindingDB:
Activity Spreadsheet -- Enzyme Inhibition Constant Data from BindingDB
Found 6 hits for monomerid = 50469133
TargetCarbonic anhydrase 9(Homo sapiens (Human))
Department Of University Of Florence
Curated by ChEMBL
LigandPNGBDBM50469133(CHEMBL4283364)
Affinity DataKi:  2.80nM. Assay description: Inhibition of recombinant human carbonic anhydrase 9 incubated for 15 mins prior to testing by stopped flow CO2 hydration assay
Ligand InfoPC cidPC sidPDB
In DepthDetails ArticlePubMed
TargetCarbonic anhydrase 1(Homo sapiens (Human))
Department Of University Of Florence
Curated by ChEMBL
LigandPNGBDBM50469133(CHEMBL4283364)
Affinity DataKi:  7.30nM. Assay description: Inhibition of recombinant human carbonic anhydrase 1 incubated for 15 mins prior to testing by stopped flow CO2 hydration assay
Ligand InfoPC cidPC sidPDB
In DepthDetails ArticlePubMed
TargetCarbonic anhydrase 5A, mitochondrial(Homo sapiens (Human))
Department Of University Of Florence
Curated by ChEMBL
LigandPNGBDBM50469133(CHEMBL4283364)
Affinity DataKi:  58nM. Assay description: Inhibition of recombinant human carbonic anhydrase 5a incubated for 15 mins prior to testing by stopped flow CO2 hydration assay
Ligand InfoPC cidPC sidPDB
In DepthDetails ArticlePubMed
TargetCarbonic anhydrase 2(Homo sapiens (Human))
Department Of University Of Florence
Curated by ChEMBL
LigandPNGBDBM50469133(CHEMBL4283364)
Affinity DataKi:  73nM. Assay description: Inhibition of recombinant human carbonic anhydrase 2 incubated for 15 mins prior to testing by stopped flow CO2 hydration assay
Ligand InfoPC cidPC sidPDB
TargetCarbonic anhydrase 5B, mitochondrial(Homo sapiens (Human))
Department Of University Of Florence
Curated by ChEMBL
LigandPNGBDBM50469133(CHEMBL4283364)
Affinity DataKi:  91nM. Assay description: Inhibition of recombinant human carbonic anhydrase 5b incubated for 15 mins prior to testing by stopped flow CO2 hydration assay
Ligand InfoPC cidPC sidPDB
In DepthDetails ArticlePubMed
TargetCarbonic anhydrase 4(Homo sapiens (Human))
Department Of University Of Florence
Curated by ChEMBL
LigandPNGBDBM50469133(CHEMBL4283364)
Affinity DataKi:  326nM. Assay description: Inhibition of recombinant human carbonic anhydrase 4 incubated for 15 mins prior to testing by stopped flow CO2 hydration assay
Ligand InfoPC cidPC sidPDB
In DepthDetails ArticlePubMed