BDBM50470392 CHEMBL4283208
SMILES CCNC(=O)Nc1cc(-c2nc(cs2)C2CC2)c(cn1)-c1cc(cnc1N1C2CCC1CN(C)C2)-c1n[nH]c(=O)o1
InChI Key InChIKey=YTFKJABGFFQSEZ-UHFFFAOYSA-N
Data  2 IC50
  Tab Delimited (TSV)   2D SDfile   Computed 3D by Vconf -m prep SDfile
Find this compound or compounds like it in BindingDB:
Activity Spreadsheet -- Enzyme Inhibition Constant Data from BindingDB
Found 2 hits for monomerid = 50470392
TargetDNA topoisomerase 4 subunit B(Escherichia coli (strain K12))
Experimental Therapeutics Centre
Curated by ChEMBL
LigandPNGBDBM50470392(CHEMBL4283208)
Affinity DataIC50:  3nM. Assay description: Inhibition of Escherichia coli ParE
Ligand InfoPC cidPC sid
In DepthDetails ArticlePubMed
TargetDNA gyrase subunit B(Escherichia coli (strain K12))
Experimental Therapeutics Centre
Curated by ChEMBL
LigandPNGBDBM50470392(CHEMBL4283208)
Affinity DataIC50:  2nM. Assay description: Inhibition of Escherichia coli GyrB (1 to 220 residues) expressed in Escherichia coli BL21(DE3)
Ligand InfoPC cidPC sid
In DepthDetails ArticlePubMed