BDBM50470397 CHEMBL4294536
SMILES CCNC(=O)Nc1cc(-c2nc(cs2)C(F)(F)F)c(cn1)-c1cc2ncccc2nc1N1CCN(C)CC1
InChI Key InChIKey=OHKRUIKTNKYKGG-UHFFFAOYSA-N
Data  2 IC50
  Tab Delimited (TSV)   2D SDfile   Computed 3D by Vconf -m prep SDfile
Find this compound or compounds like it in BindingDB:
Activity Spreadsheet -- Enzyme Inhibition Constant Data from BindingDB
Found 2 hits for monomerid = 50470397
TargetDNA gyrase subunit B(Escherichia coli (strain K12))
Experimental Therapeutics Centre
Curated by ChEMBL
LigandPNGBDBM50470397(CHEMBL4294536)
Affinity DataIC50:  3nM. Assay description: Inhibition of Escherichia coli GyrB (1 to 220 residues) expressed in Escherichia coli BL21(DE3)
Ligand InfoPC cidPC sid
In DepthDetails ArticlePubMed
TargetDNA topoisomerase 4 subunit B(Escherichia coli (strain K12))
Experimental Therapeutics Centre
Curated by ChEMBL
LigandPNGBDBM50470397(CHEMBL4294536)
Affinity DataIC50:  400nM. Assay description: Inhibition of Escherichia coli ParE
Ligand InfoPC cidPC sid
In DepthDetails ArticlePubMed