BDBM50470860 CHEMBL105328
SMILES C1Cc2cccc3cccc(C1c1c[nH]cn1)c23
InChI Key InChIKey=KFGFWNKBPWPCKX-UHFFFAOYSA-N
Data  2 KI  1 IC50  1 EC50
  Tab Delimited (TSV)   2D SDfile   Computed 3D by Vconf -m prep SDfile
Find this compound or compounds like it in BindingDB:
Activity Spreadsheet -- Enzyme Inhibition Constant Data from BindingDB
Found 4 hits for monomerid = 50470860
LigandPNGBDBM50470860(CHEMBL105328)
Affinity DataKi:  33nM. Assay description: Alpha-2 adrenergic receptor binding affinity was tested against membrane preparations of rat brain using 0.2 nM [3H]rauwolscine as radioligand
Ligand InfoPC cidPC sid
In DepthDetails ArticlePubMed
TargetAlpha-1A/Alpha-1B/Alpha-1D adrenergic receptor(Rattus norvegicus (rat))
Ohio State University
Curated by ChEMBL
LigandPNGBDBM50470860(CHEMBL105328)
Affinity DataKi:  55nM. Assay description: Alpha-1 adrenergic receptor binding affinity in rat brain membranes
Ligand InfoPC cidPC sid
In DepthDetails ArticlePubMed
TargetAlpha-2A/Alpha-2B/Alpha-2C adrenergic receptor(Homo sapiens (Human))
Ohio State University
Curated by ChEMBL
LigandPNGBDBM50470860(CHEMBL105328)
Affinity DataIC50:  1.43E+4nM. Assay description: Alpha-2 adrenergic receptor antagonistic activity in human blood platelets.
Ligand InfoPC cidPC sid
In DepthDetails ArticlePubMed
LigandPNGBDBM50470860(CHEMBL105328)
Affinity DataEC50:  156nM. Assay description: 50% Molar effective concentration for agonistic activity against Alpha-1 adrenergic receptor in rat aorta
Ligand InfoPC cidPC sid
In DepthDetails ArticlePubMed