BDBM50471718 CHEMBL98026
SMILES Cc1cc(C(C#N)c2ccc(Cl)cc2)c(Cl)cc1NC(=O)c1cc(Cl)cc(Cl)c1O
InChI Key InChIKey=PJPHMKHGQPLJID-UHFFFAOYSA-N
Data  1 IC50
  Tab Delimited (TSV)   2D SDfile   Computed 3D by Vconf -m prep SDfile
Find this compound or compounds like it in BindingDB:
Activity Spreadsheet -- Enzyme Inhibition Constant Data from BindingDB
Found 1 hit for monomerid = 50471718
TargetSporulation kinase A(Bacillus subtilis (strain 168))
The R. W. Johnson Pharmaceutical Research Institute
Curated by ChEMBL
LigandPNGBDBM50471718(CHEMBL98026)
Affinity DataIC50:  4.80E+3nM. Assay description: Inhibition of autophosphorylation of the two-component signal transduction system kinase was measured using the KinA/Spo0F regulatory system of Bacil...
Ligand InfoPC cidPC sid
In DepthDetails ArticlePubMed