BDBM50472207 CHEMBL273803
SMILES COc1cccc(c1)[C@@H]1C\C(=N/NC(=O)C(=O)NC(C)c2ccccc2)c2cc3OCOc3cc2N1
InChI Key InChIKey=DQCYPSWFLGWNBO-QPKYITKKSA-N
Data  1 IC50
  Tab Delimited (TSV)   2D SDfile   Computed 3D by Vconf -m prep SDfile
Find this compound or compounds like it in BindingDB:
Activity Spreadsheet -- Enzyme Inhibition Constant Data from BindingDB
Found 1 hit for monomerid = 50472207
TargetSimilar to alpha-tubulin isoform 1(Bos taurus)
University Of North Carolina At Chapel Hill
Curated by ChEMBL
LigandPNGBDBM50472207(CHEMBL273803)
Affinity DataIC50: >4.00E+4nM. Assay description: Inhibition of bovine brain tubulin polymerization (ITP).
Ligand InfoPC cidPC sid
In DepthDetails ArticlePubMed