BDBM50473231 CHEMBL48341
SMILES C(C[C@H]1C2CCC(C2)[C@H]1NC1=NCCO1)Cc1ccccc1
InChI Key InChIKey=PIAONGWBRPZERV-ZGUYJTEBSA-N
Data  3 KI  2 EC50
  Tab Delimited (TSV)   2D SDfile   Computed 3D by Vconf -m prep SDfile
Find this compound or compounds like it in BindingDB:
Activity Spreadsheet -- Enzyme Inhibition Constant Data from BindingDB
Found 5 hits for monomerid = 50473231
TargetAlpha-2A adrenergic receptor(Homo sapiens (Human))
Lundbeck Research Usa
Curated by ChEMBL
LigandPNGBDBM50473231(CHEMBL48341)
Affinity DataKi:  31nM. Assay description: Inhibitory constant against human Alpha-2A adrenergic receptor expressed in LM(tk-) cells using [3H]rauwolscine
Ligand InfoPC cidPC sid
In DepthDetails ArticlePubMed
TargetAlpha-2C adrenergic receptor(Homo sapiens (Human))
Lundbeck Research Usa
Curated by ChEMBL
LigandPNGBDBM50473231(CHEMBL48341)
Affinity DataKi:  123nM. Assay description: Inhibitory constant, using [3H]rauwolscine in LM(tk-) cells stably transfected with cloned human Alpha-2C adrenergic receptor
Ligand InfoPC cidPC sid
In DepthDetails ArticlePubMed
TargetAlpha-2B adrenergic receptor(Homo sapiens (Human))
Lundbeck Research Usa
Curated by ChEMBL
LigandPNGBDBM50473231(CHEMBL48341)
Affinity DataKi:  141nM. Assay description: Inhibitory constant against human Alpha-2B adrenergic receptor expressed in Y-1 cells using [3H]rauwolscine
Ligand InfoPC cidPC sid
In DepthDetails ArticlePubMed
TargetAlpha-2C adrenergic receptor(Homo sapiens (Human))
Lundbeck Research Usa
Curated by ChEMBL
LigandPNGBDBM50473231(CHEMBL48341)
Affinity DataEC50:  60nM. Assay description: Alpha2c receptor agonism measured as ability to inhibit forskolin-stimulated synthesis of cAMP
Ligand InfoPC cidPC sid
In DepthDetails ArticlePubMed
TargetAlpha-2A adrenergic receptor(Homo sapiens (Human))
Lundbeck Research Usa
Curated by ChEMBL
LigandPNGBDBM50473231(CHEMBL48341)
Affinity DataEC50:  35nM. Assay description: Alpha-2A adrenergic receptor agonism measured as ability to inhibit forskolin-stimulated synthesis of cAMP
Ligand InfoPC cidPC sid
In DepthDetails ArticlePubMed