BDBM50473889 CHEMBL332216
SMILES [H][C@@]12Cc3cc(O)ccc3C(C)(CCN1CCc1ccccc1)C2(C)C
InChI Key InChIKey=ATFJOLYMKGOWSP-BBQAJUCSSA-N
Data  1 KI  1 IC50
  Tab Delimited (TSV)   2D SDfile   Computed 3D by Vconf -m prep SDfile
Find this compound or compounds like it in BindingDB:
Activity Spreadsheet -- Enzyme Inhibition Constant Data from BindingDB
Found 2 hits for monomerid = 50473889
TargetSodium channel protein type 1/2/3 subunit alpha(Rattus norvegicus)
Boehringer Ingelheim Pharma
Curated by ChEMBL
LigandPNGBDBM50473889(CHEMBL332216)
Affinity DataKi:  1.29E+3nM. Assay description: Displacement of [3H]BTX from sodium channel of rat cerebral cortex synaptosomes
Ligand InfoPC cidPC sid
In DepthDetails ArticlePubMed
TargetSodium channel protein type 1/2/3 subunit alpha(Rattus norvegicus)
Boehringer Ingelheim Pharma
Curated by ChEMBL
LigandPNGBDBM50473889(CHEMBL332216)
Affinity DataIC50:  5.03E+3nM. Assay description: Inhibitory effect against veratridine-induced glutamate release from rat brain slices
Ligand InfoPC cidPC sid
In DepthDetails ArticlePubMed