BDBM50474391 CHEMBL3084596
SMILES Cl.CS(=O)(=O)Oc1ccc2CCN(CC[C@H]3CC[C@@H](CC3)NC(=O)c3cccc(c3)-n3cccc3)CCc2c1
InChI Key InChIKey=GHZSMFQVDZLPEQ-DWAHYBIUSA-N
Data  2 KI
  Tab Delimited (TSV)   2D SDfile   Computed 3D by Vconf -m prep SDfile
Find this compound or compounds like it in BindingDB:
Activity Spreadsheet -- Enzyme Inhibition Constant Data from BindingDB
Found 2 hits for monomerid = 50474391
TargetD(3) dopamine receptor(Homo sapiens (Human))
Glaxosmithkline Pharmaceuticals
Curated by ChEMBL
LigandPNGBDBM50474391(CHEMBL3084596)
Affinity DataKi:  3.20nM. Assay description: Binding affinity against human Dopamine receptor D3 expressed in CHO cells by using [125I]iodosulpiride as radioligand
Ligand InfoPC cidPC sid
In DepthDetails ArticlePubMed
TargetD(2) dopamine receptor(Homo sapiens (Human))
Glaxosmithkline Pharmaceuticals
Curated by ChEMBL
LigandPNGBDBM50474391(CHEMBL3084596)
Affinity DataKi:  251nM. Assay description: Binding affinity against human Dopamine receptor D2 expressed in CHO cells by using [125I]iodosulpiride as radioligand
Ligand InfoPC cidPC sid
In DepthDetails ArticlePubMed