BDBM50474409 CHEMBL3084612
SMILES Cl.Cc1coc(n1)-c1cccc(c1)C(=O)N[C@H]1CC[C@H](CCN2CCc3ccc(OS(C)(=O)=O)cc3CC2)CC1
InChI Key InChIKey=SLNCKSXMTIFQJI-XRYPOXPXSA-N
Data  2 KI
  Tab Delimited (TSV)   2D SDfile   Computed 3D by Vconf -m prep SDfile
Find this compound or compounds like it in BindingDB:
Activity Spreadsheet -- Enzyme Inhibition Constant Data from BindingDB
Found 2 hits for monomerid = 50474409
TargetD(3) dopamine receptor(Homo sapiens (Human))
Glaxosmithkline Pharmaceuticals
Curated by ChEMBL
LigandPNGBDBM50474409(CHEMBL3084612)
Affinity DataKi:  3.20nM. Assay description: Binding affinity against human Dopamine receptor D3 expressed in CHO cells by using [125I]iodosulpiride as radioligand
Ligand InfoPC cidPC sid
In DepthDetails ArticlePubMed
TargetD(2) dopamine receptor(Homo sapiens (Human))
Glaxosmithkline Pharmaceuticals
Curated by ChEMBL
LigandPNGBDBM50474409(CHEMBL3084612)
Affinity DataKi:  200nM. Assay description: Binding affinity against human Dopamine receptor D2 expressed in CHO cells by using [125I]iodosulpiride as radioligand
Ligand InfoPC cidPC sid
In DepthDetails ArticlePubMed