BDBM50475267 CHEMBL122495
SMILES C[C@](O)(CSc1ccc(NC(=O)CCl)cc1)C(=O)Nc1ccc(c(c1)C(F)(F)F)[N+]([O-])=O
InChI Key InChIKey=MRBABTVEAJIDRX-SFHVURJKSA-N
Data  1 KI
  Tab Delimited (TSV)   2D SDfile   Computed 3D by Vconf -m prep SDfile
Find this compound or compounds like it in BindingDB:
Activity Spreadsheet -- Enzyme Inhibition Constant Data from BindingDB
Found 1 hit for monomerid = 50475267
TargetAndrogen receptor(Rattus norvegicus (Rat))
Csc-Scientific Computing
Curated by ChEMBL
LigandPNGBDBM50475267(CHEMBL122495)
Affinity DataKi:  3.30nM. Assay description: Inhibition of [3H]mibolerone binding to cytosolic androgen receptor of rat ventral prostate
Ligand InfoPC cidPC sid
In DepthDetails ArticlePubMed