BDBM50475530 CHEMBL200580
SMILES COc1ccc(COc2ccccc2OCCNCCOc2c(OC)cccc2OC)cc1
InChI Key InChIKey=VFBXMTYMQDPWHB-UHFFFAOYSA-N
Data  4 KI
  Tab Delimited (TSV)   2D SDfile   Computed 3D by Vconf -m prep SDfile
Find this compound or compounds like it in BindingDB:
Activity Spreadsheet -- Enzyme Inhibition Constant Data from BindingDB
Found 4 hits for monomerid = 50475530
TargetAlpha-1D adrenergic receptor(Homo sapiens (Human))
Universit£
Curated by ChEMBL
LigandPNGBDBM50475530(CHEMBL200580)
Affinity DataKi:  0.100nM. Assay description: Displacement of [3H]prazosin from cloned human ADRA1D expressed in CHO cells
Ligand InfoPC cidPC sid
In DepthDetails ArticlePubMed
TargetAlpha-1B adrenergic receptor(Homo sapiens (Human))
Universit£
Curated by ChEMBL
LigandPNGBDBM50475530(CHEMBL200580)
Affinity DataKi:  0.398nM. Assay description: Displacement of [3H]prazosin from cloned human ADRA1B expressed in CHO cells
Ligand InfoPC cidPC sid
In DepthDetails ArticlePubMed
TargetAlpha-1A adrenergic receptor(Homo sapiens (Human))
Universit£
Curated by ChEMBL
LigandPNGBDBM50475530(CHEMBL200580)
Affinity DataKi:  2nM. Assay description: Displacement of [3H]prazosin from cloned human ADRA1A expressed in CHO cells
Ligand InfoPC cidPC sid
In DepthDetails ArticlePubMed
Target5-hydroxytryptamine receptor 1A(Homo sapiens (Human))
Universit£
Curated by ChEMBL
LigandPNGBDBM50475530(CHEMBL200580)
Affinity DataKi:  17nM. Assay description: Displacement of [3H]8-hydroxy-2-(di-n-propylamino)tetralin from cloned human 5HT1A receptor expressed in HeLa cells
Ligand InfoPC cidPC sid
In DepthDetails ArticlePubMed