BDBM50479097 CHEMBL496652
SMILES OC(=O)C(\O)=C\C(=O)c1cn(Cc2ccc(F)cc2)c2ccc(Cl)cc2c1=O
InChI Key InChIKey=KBIRJUUJIOKTBK-LSCVHKIXSA-N
Data  3 IC50
  Tab Delimited (TSV)   2D SDfile   Computed 3D by Vconf -m prep SDfile
Find this compound or compounds like it in BindingDB:
Activity Spreadsheet -- Enzyme Inhibition Constant Data from BindingDB
Found 3 hits for monomerid = 50479097
TargetIntegrase(Human immunodeficiency virus 1)
Fondazione Cenci Bolognettiuniversit£
Curated by ChEMBL
LigandPNGBDBM50479097(CHEMBL496652)
Affinity DataIC50:  28nM. Assay description: Inhibition of recombinant HIV1 integrase strand transfer activity by high throughput electrochemiluminescent assay in presence of magnesium
Ligand InfoPC cidPC sid
In DepthDetails ArticlePubMed
TargetIntegrase(Human immunodeficiency virus 1)
Fondazione Cenci Bolognettiuniversit£
Curated by ChEMBL
LigandPNGBDBM50479097(CHEMBL496652)
Affinity DataIC50:  6.40E+3nM. Assay description: Inhibition of recombinant HIV1 integrase 3'-end processing activity by gel-based assay in presence of magnesium
Ligand InfoPC cidPC sid
In DepthDetails ArticlePubMed
TargetIntegrase(Human immunodeficiency virus 1)
Fondazione Cenci Bolognettiuniversit£
Curated by ChEMBL
LigandPNGBDBM50479097(CHEMBL496652)
Affinity DataIC50:  400nM. Assay description: Inhibition of recombinant HIV1 integrase strand transfer activity by gel-based assay in presence of magnesium
Ligand InfoPC cidPC sid
In DepthDetails ArticlePubMed