BDBM50480497 CHEMBL557291::acs.jmedchem.1c00409_ST.809
SMILES CCN(CC)C(=O)CC[C@H](NC(=O)[C@@H](NC(=O)OCc1ccccc1)C(C)C)C(=O)c1nccs1
InChI Key InChIKey=REJHQVOMKVPZKD-FPOVZHCZSA-N
Data  2 KI
  Tab Delimited (TSV)   2D SDfile   Computed 3D by Vconf -m prep SDfile
Find this compound or compounds like it in BindingDB:
Activity Spreadsheet -- Enzyme Inhibition Constant Data from BindingDB
Found 2 hits for monomerid = 50480497
TargetReplicase polyprotein 1ab(Human SARS coronavirus (SARS-CoV) (Severe acute re...)
Michigan State University
LigandPNGBDBM50480497(CHEMBL557291 | acs.jmedchem.1c00409_ST.809)
Affinity DataKi:  6.14E+5nM. Assay description: This is a review article. Please point to the original journal.
Ligand InfoPC cidPC sid
In DepthDetails ArticlePubMed
TargetReplicase polyprotein 1ab(Human SARS coronavirus (SARS-CoV) (Severe acute re...)
Michigan State University
LigandPNGBDBM50480497(CHEMBL557291 | acs.jmedchem.1c00409_ST.809)
Affinity DataKi:  6.14E+5nM. Assay description: Inhibition of SARS coronavirus 3CL protease pretreated for 10 mins before substrate addition
Ligand InfoPC cidPC sid
In DepthDetails ArticlePubMed