BDBM50482161 CHEMBL1082256
SMILES [H][C@](NC(=O)[C@H](CCCNC(N)=N)NC(=O)[C@H](Cc1ccccc1)NC(=O)[C@H](Cc1cnc[nH]1)NC(=O)[C@@]([H])(NC(=O)[C@H](Cc1ccccc1)NC(=O)[C@H](CC(C)C)NC(=O)[C@H](CC(C)C)NC(=O)[C@H](CCC(N)=O)NC(=O)[C@H](CCC(N)=O)NC(=O)[C@H](CC(C)C)NC(C)=O)[C@@H](C)CC)([C@@H](C)CC)C(=O)NCC(=O)N[C@@H](CCCNC(N)=N)C(=O)N[C@@H](CCCNC(N)=N)C(=O)N[C@@H](CCCNC(N)=N)C(=O)N[C@@H](CCCNC(N)=N)C(=O)N[C@@H](CCCNC(N)=N)C(=O)N[C@@H](CCCNC(N)=N)C(=O)N[C@@H](CCCNC(N)=N)C(=O)N[C@@H](CCCNC(N)=N)C(N)=O
InChI Key InChIKey=GAXMJUZHEWAVMJ-INUPOUJOSA-N
Data  5 IC50
  Tab Delimited (TSV)   2D SDfile   Computed 3D by Vconf -m prep SDfile
Find this compound or compounds like it in BindingDB:
Activity Spreadsheet -- Enzyme Inhibition Constant Data from BindingDB
Found 5 hits for monomerid = 50482161
TargetReverse transcriptase(Human immunodeficiency virus 1)
Tokyo Medical And Dental University
Curated by ChEMBL
LigandPNGBDBM50482161(CHEMBL1082256)
Affinity DataIC50: >500nM. Assay description: Inhibition of HIV1 reverse transcriptase-associated ribonuclease H activity by fluorescence assay
Ligand InfoPC cidPC sid
In DepthDetails ArticlePubMed
TargetIntegrase(Human immunodeficiency virus 1)
Tokyo Medical And Dental University
Curated by ChEMBL
LigandPNGBDBM50482161(CHEMBL1082256)
Affinity DataIC50:  4nM. Assay description: Inhibition of HIV1 integrase strand transfer activity after 1 hr by densitometric analysis
Ligand InfoPC cidPC sid
In DepthDetails ArticlePubMed
TargetIntegrase(Human immunodeficiency virus 1)
Tokyo Medical And Dental University
Curated by ChEMBL
LigandPNGBDBM50482161(CHEMBL1082256)
Affinity DataIC50:  130nM. Assay description: Inhibition of HIV1 integrase 3'-processing activity expressed in Escherichia coli after 60 mins
Ligand InfoPC cidPC sid
In DepthDetails ArticlePubMed
TargetIntegrase(Human immunodeficiency virus 1)
Tokyo Medical And Dental University
Curated by ChEMBL
LigandPNGBDBM50482161(CHEMBL1082256)
Affinity DataIC50:  60nM. Assay description: Inhibition of HIV1 integrase strand transfer activity expressed in Escherichia coli after 60 mins
Ligand InfoPC cidPC sid
In DepthDetails ArticlePubMed
TargetIntegrase(Human immunodeficiency virus 1)
Tokyo Medical And Dental University
Curated by ChEMBL
LigandPNGBDBM50482161(CHEMBL1082256)
Affinity DataIC50:  8nM. Assay description: Inhibition of HIV1 integrase 3'-end processing activity after 1 hr by densitometric analysis
Ligand InfoPC cidPC sid
In DepthDetails ArticlePubMed