BDBM50484590 CHEMBL1939307
SMILES [H][C@@]12CNC[C@]1([H])CN(C2)c1cncc(c1)C(=O)NCCc1ccccc1F
InChI Key InChIKey=OGQBYVWPWZZUHV-CALCHBBNSA-N
Data  2 KI  1 EC50
  Tab Delimited (TSV)   2D SDfile   Computed 3D by Vconf -m prep SDfile
Find this compound or compounds like it in BindingDB:
Activity Spreadsheet -- Enzyme Inhibition Constant Data from BindingDB
Found 3 hits for monomerid = 50484590
TargetNeuronal acetylcholine receptor subunit alpha-4/beta-2(Rattus norvegicus (Rat))
Abbott Laboratories
Curated by ChEMBL
LigandPNGBDBM50484590(CHEMBL1939307)
Affinity DataKi:  0.776nM. Assay description: Displacement of [3H]cytisine from nAChR alpha4beta2 in rat brain membrane
Ligand InfoPC cidPC sid
In DepthDetails ArticlePubMed
TargetNeuronal acetylcholine receptor subunit alpha-4/beta-2(Rattus norvegicus (Rat))
Abbott Laboratories
Curated by ChEMBL
LigandPNGBDBM50484590(CHEMBL1939307)
Affinity DataKi:  0.800nM. Assay description: Displacement of [3H]cytisine from nAChR alpha4beta2 in rat brain membrane
Ligand InfoPC cidPC sid
In DepthDetails ArticlePubMed
TargetNeuronal acetylcholine receptor subunit alpha-4/beta-2(Rattus norvegicus (Rat))
Abbott Laboratories
Curated by ChEMBL
LigandPNGBDBM50484590(CHEMBL1939307)
Affinity DataEC50: >1.00E+5nM. Assay description: Partial agonist activity at human nAChR alpha4beta2 receptor expressed in human HEK293 cells assessed as calcium flux by FLIPR assay
Ligand InfoPC cidPC sid
In DepthDetails ArticlePubMed