BDBM50485600 CHEMBL2074714
SMILES CCCCC\C=C/C\C=C/C=C/C=C/[C@@H](SC[C@H](NC(C)=O)C(O)=O)[C@@H](O)CCCC(O)=O
InChI Key InChIKey=BGGYAYMMFYBWEX-HXDOPMNESA-N
Data  1 KI
  Tab Delimited (TSV)   2D SDfile   Computed 3D by Vconf -m prep SDfile
Find this compound or compounds like it in BindingDB:
Activity Spreadsheet -- Enzyme Inhibition Constant Data from BindingDB
Found 1 hit for monomerid = 50485600
TargetSolute carrier family 22 member 6(Rattus norvegicus)
University Of Rochester School Of Medicine And Dentistry
Curated by ChEMBL
LigandPNGBDBM50485600(CHEMBL2074714)
Affinity DataKi:  9.00E+3nM. Assay description: TP_TRANSPORTER: inhibition of PAH uptake in Xenopus laevis oocytes
In DepthDetails ArticlePubMed