BDBM50485601 CHEMBL2075007
SMILES COC(=O)[C@@H](CSCc1ccccc1)NC(C)=O
InChI Key InChIKey=NELLUUAGFXJBKY-GFCCVEGCSA-N
Data  1 KI
  Tab Delimited (TSV)   2D SDfile   Computed 3D by Vconf -m prep SDfile
Find this compound or compounds like it in BindingDB:
Activity Spreadsheet -- Enzyme Inhibition Constant Data from BindingDB
Found 1 hit for monomerid = 50485601
TargetSolute carrier family 22 member 6(Rattus norvegicus)
University Of Rochester School Of Medicine And Dentistry
Curated by ChEMBL
LigandPNGBDBM50485601(CHEMBL2075007)
Affinity DataKi:  400nM. Assay description: TP_TRANSPORTER: inhibition of PAH uptake in Xenopus laevis oocytes
Ligand InfoPC cidPC sid
In DepthDetails ArticlePubMed