BDBM50486614 RDS-1984
SMILES OC(=O)C(\O)=C\C(=O)c1cn(Cc2c(F)cccc2F)c2ccccc2c1=O
InChI Key InChIKey=WJNBDQXVDOJOPE-LSCVHKIXSA-N
Data  5 IC50
  Tab Delimited (TSV)   2D SDfile   Computed 3D by Vconf -m prep SDfile
Find this compound or compounds like it in BindingDB:
Activity Spreadsheet -- Enzyme Inhibition Constant Data from BindingDB
Found 5 hits for monomerid = 50486614
TargetIntegrase(Human immunodeficiency virus 1)
"Sapienza" Universit£
Curated by ChEMBL
LigandPNGBDBM50486614(RDS-1984)
Affinity DataIC50:  19nM. Assay description: Inhibition of HIV-1 integrase assessed as inhibition of strand transfer activity using 32P-labeled DNA as substrate after 1 hr by gel-based assay in ...
Ligand InfoPC cidPC sid
In DepthDetails ArticlePubMed
TargetReverse transcriptase(Human immunodeficiency virus 1)
"Sapienza" Universit£
Curated by ChEMBL
LigandPNGBDBM50486614(RDS-1984)
Affinity DataIC50:  1.08E+4nM. Assay description: Inhibition of RNase H function of HIV1 reverse transcriptase using DNA/RNA hybrid as substrate by fluorescence spectrometer analysis
Ligand InfoPC cidPC sid
In DepthDetails ArticlePubMed
TargetIntegrase(Human immunodeficiency virus 1)
"Sapienza" Universit£
Curated by ChEMBL
LigandPNGBDBM50486614(RDS-1984)
Affinity DataIC50:  7.01E+8nM. Assay description: Inhibition of Human immunodeficiency virus 1 integrase 3'-processing activity
Ligand InfoPC cidPC sid
In DepthDetails Article
TargetIntegrase(Human immunodeficiency virus 1)
"Sapienza" Universit£
Curated by ChEMBL
LigandPNGBDBM50486614(RDS-1984)
Affinity DataIC50:  1.90E+7nM. Assay description: Inhibition of Human immunodeficiency virus 1 integrase strand transfer activity
Ligand InfoPC cidPC sid
In DepthDetails Article
TargetIntegrase(Human immunodeficiency virus 1)
"Sapienza" Universit£
Curated by ChEMBL
LigandPNGBDBM50486614(RDS-1984)
Affinity DataIC50:  700nM. Assay description: Inhibition of HIV-1 integrase assessed as inhibition of 3'-processing activity using 32P-labeled DNA as substrate after 1 hr by gel-based assay in pr...
Ligand InfoPC cidPC sid
In DepthDetails ArticlePubMed