BDBM50487057 CHEMBL2253242
SMILES COc1cc(OC)nc(Oc2cccc3c(C)nn(Cc4ccc(F)cc4F)c(=O)c23)n1
InChI Key InChIKey=KNAJOPMIKWZBHZ-UHFFFAOYSA-N
Data  1 KI
  Tab Delimited (TSV)   2D SDfile   Computed 3D by Vconf -m prep SDfile
Find this compound or compounds like it in BindingDB:
Activity Spreadsheet -- Enzyme Inhibition Constant Data from BindingDB
Found 1 hit for monomerid = 50487057
TargetAcetolactate synthase, chloroplastic(Arabidopsis thaliana)
Central China Normal University
Curated by ChEMBL
LigandPNGBDBM50487057(CHEMBL2253242)
Affinity DataKi:  1.00E+6nM. Assay description: Inhibition of wild type Arabidopsis thaliana acetohydroxyacid synthase
Ligand InfoPC cidPC sid
In DepthDetails ArticlePubMed