BDBM50487377 CHEMBL2260156
SMILES OC(=O)CN1C(=O)S\C(=C\c2cccc(O)c2)C1=O
InChI Key InChIKey=QNAPHRSOOOFUQV-WEVVVXLNSA-N
Data  2 IC50
  Tab Delimited (TSV)   2D SDfile   Computed 3D by Vconf -m prep SDfile
Find this compound or compounds like it in BindingDB:
Activity Spreadsheet -- Enzyme Inhibition Constant Data from BindingDB
Found 2 hits for monomerid = 50487377
TargetAldo-keto reductase family 1 member B1(Homo sapiens (Human))TBA
LigandPNGBDBM50487377(CHEMBL2260156)
Affinity DataIC50:  4.16E+3nM. Assay description: Inhibition of aldose reductase (unknown origin)
In DepthDetails Article
TargetAldo-keto reductase family 1 member B1(Homo sapiens (Human))TBA
LigandPNGBDBM50487377(CHEMBL2260156)
Affinity DataIC50:  4.17E+3nM. Assay description: Inhibition of aldose reductase (unknown origin)
In DepthDetails Article