BDBM50487380 CHEMBL2260152
SMILES COC(=O)CN1C(=O)S\C(=C\c2cccc(Oc3ccccc3)c2)C1=O
InChI Key InChIKey=OQODMGVZUIJSIJ-LFIBNONCSA-N
Data  2 IC50
  Tab Delimited (TSV)   2D SDfile   Computed 3D by Vconf -m prep SDfile
Find this compound or compounds like it in BindingDB:
Activity Spreadsheet -- Enzyme Inhibition Constant Data from BindingDB
Found 2 hits for monomerid = 50487380
TargetAldo-keto reductase family 1 member B1(Homo sapiens (Human))TBA
LigandPNGBDBM50487380(CHEMBL2260152)
Affinity DataIC50:  260nM. Assay description: Inhibition of aldose reductase (unknown origin)
In DepthDetails Article
TargetAldo-keto reductase family 1 member B1(Homo sapiens (Human))TBA
LigandPNGBDBM50487380(CHEMBL2260152)
Affinity DataIC50:  260nM. Assay description: Inhibition of aldose reductase (unknown origin)
In DepthDetails Article