BDBM50488719 CHEMBL2298876
SMILES COc1ccc(N2C(=O)c3ccccc3C2=O)c(c1)[N+]([O-])=O
InChI Key InChIKey=DSXDOHMNRWKJAA-UHFFFAOYSA-N
Data  1 KI
  Tab Delimited (TSV)   2D SDfile   Computed 3D by Vconf -m prep SDfile
Find this compound or compounds like it in BindingDB:
Activity Spreadsheet -- Enzyme Inhibition Constant Data from BindingDB
Found 1 hit for monomerid = 50488719
TargetSodium channel protein type 2 subunit alpha(Homo sapiens (Human))TBA
LigandPNGBDBM50488719(CHEMBL2298876)
Affinity DataKi:  1.08E+5nM. Assay description: Binding affinity to Nav 1.2 (unknown origin)
In DepthDetails Article