BDBM50491416 CHEMBL2381584
SMILES [H][C@@]12CC[C@@]3(C)[C@@H](C[C@H](OC(=O)CC(=O)OC)C(=O)[C@]3([H])[C@@]1(C)C[C@H](OC2=O)c1ccoc1)C(=O)OC
InChI Key InChIKey=ICJYWRXMAGHSJZ-BNSSAQQSSA-N
Data  3 KI  1 EC50
  Tab Delimited (TSV)   2D SDfile   Computed 3D by Vconf -m prep SDfile
Find this compound or compounds like it in BindingDB:
Activity Spreadsheet -- Enzyme Inhibition Constant Data from BindingDB
Found 4 hits for monomerid = 50491416
TargetKappa-type opioid receptor(Homo sapiens (Human))
University Of Mississippi
Curated by ChEMBL
LigandPNGBDBM50491416(CHEMBL2381584)
Affinity DataKi:  2nM. Assay description: Displacement of [3H]U69593 from kappa opioid receptor (unknown origin)
Ligand InfoPC cidPC sid
In DepthDetails ArticlePubMed
TargetDelta-type opioid receptor(Homo sapiens (Human))
University Of Mississippi
Curated by ChEMBL
LigandPNGBDBM50491416(CHEMBL2381584)
Affinity DataKi:  4.32E+3nM. Assay description: Displacement of [3H]DADLE from delta opioid receptor (unknown origin)
Ligand InfoPC cidPC sid
In DepthDetails ArticlePubMed
TargetMu-type opioid receptor(Homo sapiens (Human))
University Of Mississippi
Curated by ChEMBL
LigandPNGBDBM50491416(CHEMBL2381584)
Affinity DataKi: >1.00E+4nM. Assay description: Displacement of [3H]DAMGO from mu opioid receptor (unknown origin)
Ligand InfoPC cidPC sid
In DepthDetails ArticlePubMed
TargetKappa-type opioid receptor(Homo sapiens (Human))
University Of Mississippi
Curated by ChEMBL
LigandPNGBDBM50491416(CHEMBL2381584)
Affinity DataEC50:  137nM. Assay description: Agonist activity at kappa opioid receptor in human HEK293 cells assessed as stimulation of Galphai signaling by cAMP assay
Ligand InfoPC cidPC sid
In DepthDetails ArticlePubMed