BDBM50491450 CHEMBL2381772
SMILES CCOC(=O)CCCNc1nc(NCCc2ccc(OCCCC(=O)OCC)cc2)nc2nc(nn12)-c1ccco1
InChI Key InChIKey=PYQLYCZMHJUUFX-UHFFFAOYSA-N
Data  2 IC50
  Tab Delimited (TSV)   2D SDfile   Computed 3D by Vconf -m prep SDfile
Find this compound or compounds like it in BindingDB:
Activity Spreadsheet -- Enzyme Inhibition Constant Data from BindingDB
Found 2 hits for monomerid = 50491450
TargetAdenosine receptor A2a(Homo sapiens (Human))
Monash University (Parkville Campus)
Curated by ChEMBL
LigandPNGBDBM50491450(CHEMBL2381772)
Affinity DataIC50: <1.00E+5nM. Assay description: Antagonist activity at recombinant human adenosine A2A receptor expressed in CHO cells assessed as inhibition of NECA-induced cAMP production after 6...
Ligand InfoPC cidPC sid
In DepthDetails ArticlePubMed
TargetAdenosine receptor A2a(Homo sapiens (Human))
Monash University (Parkville Campus)
Curated by ChEMBL
LigandPNGBDBM50491450(CHEMBL2381772)
Affinity DataIC50: >1.00E+5nM. Assay description: Antagonist activity at recombinant human adenosine A2A receptor expressed in CHO cells assessed as inhibition of NECA-induced cAMP production after 6...
Ligand InfoPC cidPC sid
In DepthDetails ArticlePubMed