BDBM50493085 CHEMBL2420940
SMILES CN(C)c1cccc(C(O)=O)c1C(O)=O
InChI Key InChIKey=SJAXNTIFHHIZLM-UHFFFAOYSA-N
Data  1 IC50
  Tab Delimited (TSV)   2D SDfile   Computed 3D by Vconf -m prep SDfile
Find this compound or compounds like it in BindingDB:
Activity Spreadsheet -- Enzyme Inhibition Constant Data from BindingDB
Found 1 hit for monomerid = 50493085
TargetMetallo-beta-lactamase IMP-1(Pseudomonas aeruginosa)
Meiji Seika Pharma
Curated by ChEMBL
LigandPNGBDBM50493085(CHEMBL2420940)
Affinity DataIC50:  9.45E+4nM. Assay description: Inhibition of carbapenems-resistant Pseudomonas aeruginosa MSC15369 metallo-beta-lactamase IMP1 expressed in Escherichia coli DH5[alpha] using nitroc...
Ligand InfoPC cidPC sid
In DepthDetails ArticlePubMed