BDBM50493091 CHEMBL2420932
SMILES OC(=O)c1cccc(OCc2ccccc2)c1C(O)=O
InChI Key InChIKey=KHDMFSQVFYSAQO-UHFFFAOYSA-N
Data  1 IC50
  Tab Delimited (TSV)   2D SDfile   Computed 3D by Vconf -m prep SDfile
Find this compound or compounds like it in BindingDB:
Activity Spreadsheet -- Enzyme Inhibition Constant Data from BindingDB
Found 1 hit for monomerid = 50493091
TargetMetallo-beta-lactamase IMP-1(Pseudomonas aeruginosa)
Meiji Seika Pharma
Curated by ChEMBL
LigandPNGBDBM50493091(CHEMBL2420932)
Affinity DataIC50:  7.40E+3nM. Assay description: Inhibition of carbapenems-resistant Pseudomonas aeruginosa MSC15369 metallo-beta-lactamase IMP1 expressed in Escherichia coli DH5[alpha] using nitroc...
Ligand InfoPC cidPC sid
In DepthDetails ArticlePubMed