BDBM50494230 CHEMBL3217051
SMILES Cl.Cl.[H][C@]12C[C@@H](C[C@](C1)([C@H](C)CN2CCCc1ccccc1)c1cccc(O)c1)NCC
InChI Key InChIKey=VMZGEVKTRJHXRF-ZYQPZWKOSA-N
Data  3 KI  1 EC50
  Tab Delimited (TSV)   2D SDfile   Computed 3D by Vconf -m prep SDfile
Find this compound or compounds like it in BindingDB:
Activity Spreadsheet -- Enzyme Inhibition Constant Data from BindingDB
Found 4 hits for monomerid = 50494230
TargetMu-type opioid receptor(Homo sapiens (Human))
Research Triangle Institute
Curated by ChEMBL
LigandPNGBDBM50494230(CHEMBL3217051)
Affinity DataKi:  3.40nM. Assay description: Displacement of [3H]DAMGO from human mu opioid receptor expressed in CHO cells
Ligand InfoPC cidPC sid
In DepthDetails ArticlePubMed
TargetKappa-type opioid receptor(Homo sapiens (Human))
Research Triangle Institute
Curated by ChEMBL
LigandPNGBDBM50494230(CHEMBL3217051)
Affinity DataKi:  8.20nM. Assay description: Displacement of [3H]U-69593 from human kappa opioid receptor expressed in CHO cells
Ligand InfoPC cidPC sid
In DepthDetails ArticlePubMed
TargetDelta-type opioid receptor(Homo sapiens (Human))
Research Triangle Institute
Curated by ChEMBL
LigandPNGBDBM50494230(CHEMBL3217051)
Affinity DataKi:  264nM. Assay description: Displacement of [3H]DADLE from human delta opioid receptor expressed in CHO cells
Ligand InfoPC cidPC sid
In DepthDetails ArticlePubMed
TargetMu-type opioid receptor(Homo sapiens (Human))
Research Triangle Institute
Curated by ChEMBL
LigandPNGBDBM50494230(CHEMBL3217051)
Affinity DataEC50:  33nM. Assay description: Agonist activity at human mu opioid receptor expressed in CHO cells by [35S]GTPgammaS binding assay
Ligand InfoPC cidPC sid
In DepthDetails ArticlePubMed