BDBM50495308 CHEMBL3103546
SMILES [#6]-[#8]-c1ccc(-[#6]-[#6]-[#6](=O)-c2c(-[#8])c(-[#6]\[#6]=[#6](\[#6])-[#6])c3-[#8]C([#6])([#6])[#6](-[#8])-[#6]-c3c2-[#8])cc1
InChI Key InChIKey=LZXJHEPXISBUNX-UHFFFAOYSA-N
Data  2 KI  2 IC50
  Tab Delimited (TSV)   2D SDfile   Computed 3D by Vconf -m prep SDfile
Find this compound or compounds like it in BindingDB:
Activity Spreadsheet -- Enzyme Inhibition Constant Data from BindingDB
Found 4 hits for monomerid = 50495308
TargetPolyphenol oxidase 2(Agaricus bisporus (Common mushroom))
Gyeongsang National University
Curated by ChEMBL
LigandPNGBDBM50495308(CHEMBL3103546)
Affinity DataKi:  480nM. Assay description: Competitive inhibition of mushroom tyrosinase using L-tyrosine as substrate preincubated for 10 mins with substrate followed by enzyme addition measu...
Ligand InfoPC cidPC sid
In DepthDetails ArticlePubMed
TargetPolyphenol oxidase 2(Agaricus bisporus (Common mushroom))
Gyeongsang National University
Curated by ChEMBL
LigandPNGBDBM50495308(CHEMBL3103546)
Affinity DataKi:  8.16E+3nM. Assay description: Competitive inhibition of mushroom tyrosinase using L-DOPA as substrate preincubated for 10 mins with substrate followed by enzyme addition measured ...
Ligand InfoPC cidPC sid
In DepthDetails ArticlePubMed
TargetPolyphenol oxidase 2(Agaricus bisporus (Common mushroom))
Gyeongsang National University
Curated by ChEMBL
LigandPNGBDBM50495308(CHEMBL3103546)
Affinity DataIC50:  1.01E+3nM. Assay description: Inhibition of mushroom tyrosinase using L-tyrosine as substrate preincubated for 10 mins with substrate followed by enzyme addition measured after 15...
Ligand InfoPC cidPC sid
In DepthDetails ArticlePubMed
TargetPolyphenol oxidase 2(Agaricus bisporus (Common mushroom))
Gyeongsang National University
Curated by ChEMBL
LigandPNGBDBM50495308(CHEMBL3103546)
Affinity DataIC50:  1.95E+4nM. Assay description: Inhibition of mushroom tyrosinase using L-DOPA as substrate preincubated for 10 mins with substrate followed by enzyme addition measured after 15 min...
Ligand InfoPC cidPC sid
In DepthDetails ArticlePubMed